Target
Fatty acid-binding protein, adipocyte
Ligand
BDBM50247990
Substrate
Meas. Tech.
ChEMBL_566942 (CHEMBL964125)
IC50
970±n/a nM
Citation
 Barf, TLehmann, FHammer, KHaile, SAxen, EMedina, CUppenberg, JSvensson, SRondahl, LLundbäck, T N-Benzyl-indolo carboxylic acids: Design and synthesis of potent and selective adipocyte fatty-acid binding protein (A-FABP) inhibitors. Bioorg Med Chem Lett 19:1745-8 (2009)  
Target
Name:
Fatty acid-binding protein, adipocyte
Synonyms:
A-FABP ALBP FABP4 Fatty acid binding protein adipocyte Fatty acid-binding protein 4 (FABP4)
Type:
Enzyme
Mol. Mass.:
14719.23
Organism:
Homo sapiens (Human)
Description:
P15090
Residue:
132
  
Inhibitor
Name:
BDBM50247990
Synonyms:
4-benzyl-1,2,3,4-tetrahydrocyclopenta[b]indole-5-carboxylic acid | CHEMBL459902
Type:
Small organic molecule
Emp. Form.:
C19H17NO2
Mol. Mass.:
291.3438
SMILES:
OC(=O)c1cccc2c3CCCc3n(Cc3ccccc3)c12
: