Target
Fatty acid-binding protein, heart
Ligand
BDBM50247970
Substrate
Meas. Tech.
ChEMBL_566943 (CHEMBL964126)
IC50
>10000±n/a nM
Citation
 Barf, TLehmann, FHammer, KHaile, SAxen, EMedina, CUppenberg, JSvensson, SRondahl, LLundbäck, T N-Benzyl-indolo carboxylic acids: Design and synthesis of potent and selective adipocyte fatty-acid binding protein (A-FABP) inhibitors. Bioorg Med Chem Lett 19:1745-8 (2009)  
Target
Name:
Fatty acid-binding protein, heart
Synonyms:
FABP11 FABPH_HUMAN MDGI
Type:
PROTEIN
Mol. Mass.:
14858.36
Organism:
Homo sapiens (Human)
Description:
ChEMBL_1463784
Residue:
133
  
Inhibitor
Name:
BDBM50247970
Synonyms:
9-(4-methylbenzyl)-2,3,4,9-tetrahydro-1H-carbazole-8-carboxylic acid | CHEMBL454404
Type:
Small organic molecule
Emp. Form.:
C21H21NO2
Mol. Mass.:
319.3969
SMILES:
Cc1ccc(Cn2c3CCCCc3c3cccc(C(O)=O)c23)cc1
: