Target
Fatty acid-binding protein, adipocyte
Ligand
BDBM50247991
Substrate
Meas. Tech.
ChEMBL_566944 (CHEMBL964127)
IC50
670±n/a nM
Citation
 Barf, TLehmann, FHammer, KHaile, SAxen, EMedina, CUppenberg, JSvensson, SRondahl, LLundbäck, T N-Benzyl-indolo carboxylic acids: Design and synthesis of potent and selective adipocyte fatty-acid binding protein (A-FABP) inhibitors. Bioorg Med Chem Lett 19:1745-8 (2009)  
Target
Name:
Fatty acid-binding protein, adipocyte
Synonyms:
A-FABP ALBP FABP4 Fatty acid binding protein adipocyte Fatty acid-binding protein 4 (FABP4)
Type:
Enzyme
Mol. Mass.:
14719.23
Organism:
Homo sapiens (Human)
Description:
P15090
Residue:
132
  
Inhibitor
Name:
BDBM50247991
Synonyms:
9-propyl-2,3,4,9-tetrahydro-1H-carbazole-8-carboxylic acid | CHEMBL501361
Type:
Small organic molecule
Emp. Form.:
C16H19NO2
Mol. Mass.:
257.3276
SMILES:
CCCn1c2CCCCc2c2cccc(C(O)=O)c12
: