Target
Cathepsin K
Ligand
BDBM50249446
Substrate
Meas. Tech.
ChEMBL_499502 (CHEMBL1021994)
IC50
6±n/a nM
Citation
 Morley, ADKenny, PWBurton, BHeald, RAMacfaul, PAMullett, JPage, KPorres, SSRibeiro, LRSmith, PWard, SWilkinson, TJ 5-Aminopyrimidin-2-ylnitriles as cathepsin K inhibitors. Bioorg Med Chem Lett 19:1658-61 (2009)  
Target
Name:
Cathepsin K
Synonyms:
CATK_HUMAN CTSO Cathepsin O Cathepsin X
Type:
Enzyme
Mol. Mass.:
36975.68
Organism:
Homo sapiens (Human)
Description:
P43235
Residue:
329
  
Inhibitor
Name:
BDBM50249446
Synonyms:
5-amino-4-(isobutylamino)-6-(piperazin-1-yl)pyrimidine-2-carbonitrile | CHEMBL474484
Type:
Small organic molecule
Emp. Form.:
C13H21N7
Mol. Mass.:
275.3527
SMILES:
CC(C)CNc1nc(nc(N2CCNCC2)c1N)C#N
: