Target
Cathepsin S
Ligand
BDBM50249446
Substrate
Meas. Tech.
ChEMBL_499503 (CHEMBL1021995)
IC50
890±n/a nM
Citation
 Morley, ADKenny, PWBurton, BHeald, RAMacfaul, PAMullett, JPage, KPorres, SSRibeiro, LRSmith, PWard, SWilkinson, TJ 5-Aminopyrimidin-2-ylnitriles as cathepsin K inhibitors. Bioorg Med Chem Lett 19:1658-61 (2009)  
Target
Name:
Cathepsin S
Synonyms:
CATS_HUMAN Cathepsin S (Cat S) | cathepsin S preproprotein
Type:
Protein
Mol. Mass.:
37507.38
Organism:
Homo sapiens (Human)
Description:
P25774
Residue:
331
  
Inhibitor
Name:
BDBM50249446
Synonyms:
5-amino-4-(isobutylamino)-6-(piperazin-1-yl)pyrimidine-2-carbonitrile | CHEMBL474484
Type:
Small organic molecule
Emp. Form.:
C13H21N7
Mol. Mass.:
275.3527
SMILES:
CC(C)CNc1nc(nc(N2CCNCC2)c1N)C#N
: