Target
Cytochrome P450 2C9
Ligand
BDBM50249446
Substrate
Meas. Tech.
ChEMBL_499507 (CHEMBL1021999)
IC50
>10000±n/a nM
Citation
 Morley, ADKenny, PWBurton, BHeald, RAMacfaul, PAMullett, JPage, KPorres, SSRibeiro, LRSmith, PWard, SWilkinson, TJ 5-Aminopyrimidin-2-ylnitriles as cathepsin K inhibitors. Bioorg Med Chem Lett 19:1658-61 (2009)  
Target
Name:
Cytochrome P450 2C9
Synonyms:
(R)-limonene 6-monooxygenase CP2C9_HUMAN CYP2C9 Cytochrome P450 2C9 (CYP2C9 ) P-450MP P450 PB-1 | S-mephenytoin 4-hydroxylase
Type:
Enzyme
Mol. Mass.:
55636.33
Organism:
Homo sapiens (Human)
Description:
P11712
Residue:
490
  
Inhibitor
Name:
BDBM50249446
Synonyms:
5-amino-4-(isobutylamino)-6-(piperazin-1-yl)pyrimidine-2-carbonitrile | CHEMBL474484
Type:
Small organic molecule
Emp. Form.:
C13H21N7
Mol. Mass.:
275.3527
SMILES:
CC(C)CNc1nc(nc(N2CCNCC2)c1N)C#N
: