Target
Neuropeptide Y receptor type 5
Ligand
BDBM50257947
Substrate
Meas. Tech.
ChEMBL_566300 (CHEMBL956810)
IC50
59±n/a nM
Citation
 Sato, NJitsuoka, MIshikawa, SNagai, KTsuge, HAndo, MOkamoto, OIwaasa, HGomori, AIshihara, AKanatani, AFukami, T Discovery of substituted 2,4,4-triarylimidazoline derivatives as potent and selective neuropeptide Y Y5 receptor antagonists. Bioorg Med Chem Lett 19:1670-4 (2009)  
Target
Name:
Neuropeptide Y receptor type 5
Synonyms:
NPY-Y5 NPY5-R NPY5R_HUMAN NPYY5 Neuropeptide Y receptor type 5 ( NPY Y5) | Y5 receptor
Type:
Enzyme
Mol. Mass.:
50746.64
Organism:
Homo sapiens (Human)
Description:
Q15761
Residue:
445
  
Inhibitor
Name:
BDBM50257947
Synonyms:
(3-(4,4-bis(4-fluorophenyl)-4,5-dihydro-1H-imidazol-2-yl)phenyl)methanol | CHEMBL493998
Type:
Small organic molecule
Emp. Form.:
C22H18F2N2O
Mol. Mass.:
364.3879
SMILES:
OCc1cccc(c1)C1=NC(CN1)(c1ccc(F)cc1)c1ccc(F)cc1
: