Target
Neuropeptide Y receptor type 5
Ligand
BDBM50258088
Substrate
Meas. Tech.
ChEMBL_566300 (CHEMBL956810)
IC50
17±n/a nM
Citation
 Sato, NJitsuoka, MIshikawa, SNagai, KTsuge, HAndo, MOkamoto, OIwaasa, HGomori, AIshihara, AKanatani, AFukami, T Discovery of substituted 2,4,4-triarylimidazoline derivatives as potent and selective neuropeptide Y Y5 receptor antagonists. Bioorg Med Chem Lett 19:1670-4 (2009)  
Target
Name:
Neuropeptide Y receptor type 5
Synonyms:
NPY-Y5 NPY5-R NPY5R_HUMAN NPYY5 Neuropeptide Y receptor type 5 ( NPY Y5) | Y5 receptor
Type:
Enzyme
Mol. Mass.:
50746.64
Organism:
Homo sapiens (Human)
Description:
Q15761
Residue:
445
  
Inhibitor
Name:
BDBM50258088
Synonyms:
5-(4,4-bis(4-fluorophenyl)-4,5-dihydro-1H-imidazol-2-yl)nicotinonitrile | CHEMBL523339
Type:
Small organic molecule
Emp. Form.:
C21H14F2N4
Mol. Mass.:
360.3595
SMILES:
Fc1ccc(cc1)C1(CNC(=N1)c1cncc(c1)C#N)c1ccc(F)cc1
: