Target
Neuropeptide Y receptor type 5
Ligand
BDBM50257955
Substrate
Meas. Tech.
ChEMBL_567024 (CHEMBL1029921)
IC50
2±n/a nM
Citation
 Sakamoto, TMoriya, MHaga, YTakahashi, TShibata, TOkamoto, ONonoshita, KKitazawa, HHidaka, MGomori, AIwaasa, HIshihara, AKanatani, AFukami, TGao, YDMacneil, DJYang, L Identification of novel and orally active spiroindoline NPY Y5 receptor antagonists. Bioorg Med Chem Lett 19:1564-8 (2009)  
Target
Name:
Neuropeptide Y receptor type 5
Synonyms:
NPY-Y5 NPY5-R NPY5R_HUMAN NPYY5 Neuropeptide Y receptor type 5 ( NPY Y5) | Y5 receptor
Type:
Enzyme
Mol. Mass.:
50746.64
Organism:
Homo sapiens (Human)
Description:
Q15761
Residue:
445
  
Inhibitor
Name:
BDBM50257955
Synonyms:
CHEMBL524029 | N-(4-acetylphenyl)-1-sulfamoylspiro[indoline-3,4'-piperidine]-1'-carboxamide
Type:
Small organic molecule
Emp. Form.:
C21H24N4O4S
Mol. Mass.:
428.505
SMILES:
CC(=O)c1ccc(NC(=O)N2CCC3(CN(c4ccccc34)S(N)(=O)=O)CC2)cc1
: