Target
Gonadotropin-releasing hormone receptor
Ligand
BDBM50257514
Substrate
Meas. Tech.
ChEMBL_566054 (CHEMBL954319)
IC50
18±n/a nM
Citation
 Hauze, DBChengalvala, MVCottom, JEFeingold, IBGarrick, LGreen, DMHuselton, CKao, WKees, KLundquist, JTMann, CWMehlmann, JFRogers, JFShanno, LWrobel, JPelletier, JC Small molecule antagonists of the gonadotropin-releasing hormone (GnRH) receptor: structure-activity relationships of small heterocyclic groups appended to the 2-phenyl-4-piperazinyl-benzimidazole template. Bioorg Med Chem Lett 19:1986-90 (2009)  
Target
Name:
Gonadotropin-releasing hormone receptor
Synonyms:
GNRHR GRHR GnRH-R Gonadotropin-releasing hormone receptor | Gonadotropin-releasing hormone receptor (GnRH)
Type:
Enzyme
Mol. Mass.:
37749.45
Organism:
Homo sapiens (Human)
Description:
P30968
Residue:
328
  
Inhibitor
Name:
BDBM50257514
Synonyms:
2-(4-tert-butylphenyl)-4-(4-((2-ethyl-1-methyl-1H-imidazol-4-yl)methyl)piperazin-1-yl)-1H-benzo[d]imidazole | CHEMBL494738
Type:
Small organic molecule
Emp. Form.:
C28H36N6
Mol. Mass.:
456.6256
SMILES:
CCc1nc(CN2CCN(CC2)c2cccc3[nH]c(nc23)-c2ccc(cc2)C(C)(C)C)cn1C
: