Target
Gonadotropin-releasing hormone receptor
Ligand
BDBM50256884
Substrate
Meas. Tech.
ChEMBL_562459 (CHEMBL1010962)
IC50
140±n/a nM
Citation
 Pelletier, JCChengalvala, MVCottom, JEFeingold, IBGreen, DMHauze, DBHuselton, CAJetter, JWKopf, GSLundquist, JTMagolda, RLMann, CWMehlmann, JFRogers, JFShanno, LKAdams, WRTio, COWrobel, JE Discovery of 6-({4-[2-(4-tert-butylphenyl)-1H-benzimidazol-4-yl]piperazin-1-yl}methyl)quinoxaline (WAY-207024): an orally active antagonist of the gonadotropin releasing hormone receptor (GnRH-R). J Med Chem 52:2148-52 (2009)  
Target
Name:
Gonadotropin-releasing hormone receptor
Synonyms:
GNRHR GRHR GnRH-R Gonadotropin-releasing hormone receptor | Gonadotropin-releasing hormone receptor (GnRH)
Type:
Enzyme
Mol. Mass.:
37749.45
Organism:
Homo sapiens (Human)
Description:
P30968
Residue:
328
  
Inhibitor
Name:
BDBM50256884
Synonyms:
7-((4-(2-(4-tert-butylphenyl)-1H-benzo[d]imidazol-4-yl)piperazin-1-yl)methyl)quinoline | CHEMBL475660
Type:
Small organic molecule
Emp. Form.:
C31H33N5
Mol. Mass.:
475.6272
SMILES:
CC(C)(C)c1ccc(cc1)-c1nc2c(cccc2[nH]1)N1CCN(Cc2ccc3cccnc3c2)CC1
: