Target
Sphingosine 1-phosphate receptor 4
Ligand
BDBM50249264
Substrate
Meas. Tech.
ChEMBL_499715 (CHEMBL980650)
IC50
24.8±n/a nM
Citation
 Evindar, GSatz, ALBernier, SGKavarana, MJDoyle, ELorusso, JTaghizadeh, NHalley, KHutchings, AKelley, MSWright, ADSaha, AKHannig, GMorgan, BAWestlin, WF Synthesis and evaluation of arylalkoxy- and biarylalkoxy-phenylamide and phenylimidazoles as potent and selective sphingosine-1-phosphate receptor subtype-1 agonists. Bioorg Med Chem Lett 19:2315-9 (2009)  
Target
Name:
Sphingosine 1-phosphate receptor 4
Synonyms:
EDG6 S1P receptor 4 S1P4 S1PR4_HUMAN Sphingosine 1-phosphate receptor Edg-6 sphingosine-1-phosphate 4 S1P4
Type:
G Protein-Coupled Receptor (GPCR)
Mol. Mass.:
41647.39
Organism:
Homo sapiens (Human)
Description:
Residue:
384
  
Inhibitor
Name:
BDBM50249264
Synonyms:
(S)-2-amino-3-(4-(4-(biphenyl-4-yl)butoxy)phenylamino)-2-methyl-3-oxopropyl dihydrogen phosphate | CHEMBL475253
Type:
Small organic molecule
Emp. Form.:
C26H31N2O6P
Mol. Mass.:
498.5079
SMILES:
C[C@](N)(COP(O)(O)=O)C(=O)Nc1ccc(OCCCCc2ccc(cc2)-c2ccccc2)cc1
: