Target
5-hydroxytryptamine receptor 2C
Ligand
BDBM50257391
Substrate
Meas. Tech.
ChEMBL_566860 (CHEMBL957594)
EC50
3.3±n/a nM
Citation
 Cho, SJJensen, NHKurome, TKadari, SManzano, MLMalberg, JECaldarone, BRoth, BLKozikowski, AP Selective 5-hydroxytryptamine 2C receptor agonists derived from the lead compound tranylcypromine: identification of drugs with antidepressant-like action. J Med Chem 52:1885-902 (2009)  
Target
Name:
5-hydroxytryptamine receptor 2C
Synonyms:
5-HT-2C 5-HT2C-INI 5-HTR2C 5-hydroxytryptamine receptor 2C (5-HT-2C) 5HT-1C HTR1C Serotonin (5-HT3) receptor Serotonin Receptor 2C
Type:
G Protein-Coupled Receptor (GPCR)
Mol. Mass.:
51836.79
Organism:
Homo sapiens (Human)
Description:
P28335
Residue:
458
  
Inhibitor
Name:
BDBM50257391
Synonyms:
CHEMBL492926 | trans-[2-(3-Fluorophenyl)cyclopropyl]methylamine Hydrochloride
Type:
Small organic molecule
Emp. Form.:
C10H12FN
Mol. Mass.:
165.2074
SMILES:
NC[C@H]1C[C@@H]1c1cccc(F)c1
: