Target
RAC-beta serine/threonine-protein kinase
Ligand
BDBM50278834
Substrate
Meas. Tech.
ChEMBL_565649 (CHEMBL959245)
Ki
40±n/a nM
Citation
 Seefeld, MARouse, MBMcNulty, KCSun, LWang, JYamashita, DSLuengo, JIZhang, SMinthorn, EAConcha, NOHeerding, DA Discovery of 5-pyrrolopyridinyl-2-thiophenecarboxamides as potent AKT kinase inhibitors. Bioorg Med Chem Lett 19:2244-8 (2009)  
Target
Name:
RAC-beta serine/threonine-protein kinase
Synonyms:
AKT2 PKB beta Protein kinase B (Akt 2) Protein kinase B, beta RAC-alpha serine/threonine-protein kinase (AKT2) RAC-beta serine/threonine-protein kinase (AKT2) Serine/threonine-protein kinase AKT2 | Serine/threonine-protein kinase Rac alpha/beta
Type:
Enzyme
Mol. Mass.:
55766.64
Organism:
Homo sapiens (Human)
Description:
Residue:
481
  
Inhibitor
Name:
BDBM50278834
Synonyms:
CHEMBL524998 | N-((S)-1-amino-3-(4-methoxyphenyl)propan-2-yl)-4-bromo-5-(1H-pyrrolo[2,3-b]pyridin-4-yl)thiophene-2-carboxamide
Type:
Small organic molecule
Emp. Form.:
C22H21BrN4O2S
Mol. Mass.:
485.397
SMILES:
COc1ccc(C[C@@H](CN)NC(=O)c2cc(Br)c(s2)-c2ccnc3[nH]ccc23)cc1
: