Target
RAC-alpha serine/threonine-protein kinase
Ligand
BDBM50278647
Substrate
Meas. Tech.
ChEMBL_565646 (CHEMBL959242)
IC50
40±n/a nM
Citation
 Seefeld, MARouse, MBMcNulty, KCSun, LWang, JYamashita, DSLuengo, JIZhang, SMinthorn, EAConcha, NOHeerding, DA Discovery of 5-pyrrolopyridinyl-2-thiophenecarboxamides as potent AKT kinase inhibitors. Bioorg Med Chem Lett 19:2244-8 (2009)  
Target
Name:
RAC-alpha serine/threonine-protein kinase
Synonyms:
AKT phosphorylation (p-AKT) AKT1/PPP1CA C-AKT PKB alpha Protein kinase B Protein kinase B (Akt 1) Protein kinase B alpha Proto-oncogene Akt (Akt1) Proto-oncogene c-Akt (AKT1) RAC-PK-alpha RAC-alpha serine/threonine-protein kinase (AKT1) | RAC-alpha serine/threonine-protein kinase (pAKT)
Type:
Enzyme
Mol. Mass.:
55681.25
Organism:
Homo sapiens (Human)
Description:
P31749
Residue:
480
  
Inhibitor
Name:
BDBM50278647
Synonyms:
CHEMBL512148 | N-(2-amino-2-phenylethyl)-4-bromo-5-(1H-pyrrolo[2,3-b]pyridin-4-yl)thiophene-2-carboxamide
Type:
Small organic molecule
Emp. Form.:
C20H17BrN4OS
Mol. Mass.:
441.344
SMILES:
NC(CNC(=O)c1cc(Br)c(s1)-c1ccnc2[nH]ccc12)c1ccccc1
: