Target
Bifunctional epoxide hydrolase 2
Ligand
BDBM50278162
Substrate
Meas. Tech.
ChEMBL_497574 (CHEMBL999421)
IC50
28.7±n/a nM
Citation
 Xie, YLiu, YGong, GSmith, DHYan, FRinderspacher, AFeng, YZhu, ZLi, XDeng, SXBranden, LVidovic, DChung, CSchürer, SMorisseau, CHammock, BDLandry, DW Discovery of potent non-urea inhibitors of soluble epoxide hydrolase. Bioorg Med Chem Lett 19:2354-9 (2009)  
Target
Name:
Bifunctional epoxide hydrolase 2
Synonyms:
Cytosolic epoxide hydrolase 2 EPHX2 HYES_HUMAN Soluble epoxide hydrolase (sEH) | epoxide hydrolase 2, cytoplasmic
Type:
Enzyme
Mol. Mass.:
62613.07
Organism:
Homo sapiens (Human)
Description:
P34913
Residue:
555
  
Inhibitor
Name:
BDBM50278162
Synonyms:
CHEMBL469360 | N-(2-chloro-5-(trifluoromethyl)benzyl)-1-(mesitylsulfonyl)piperidine-4-carboxamide
Type:
Small organic molecule
Emp. Form.:
C23H26ClF3N2O3S
Mol. Mass.:
502.977
SMILES:
Cc1cc(C)c(c(C)c1)S(=O)(=O)N1CCC(CC1)C(=O)NCc1cc(ccc1Cl)C(F)(F)F
: