Target
Muscarinic acetylcholine receptor M3
Ligand
BDBM50003637
Substrate
Meas. Tech.
ChEMBL_562970 (CHEMBL1015369)
IC50
<10000±n/a nM
Citation
 Lainé, DIMcCleland, BThomas, SNeipp, CUnderwood, BDufour, JWiddowson, KLPalovich, MRBlaney, FEFoley, JJWebb, EFLuttmann, MABurman, MBelmonte, KSalmon, M Discovery of novel 1-azoniabicyclo[2.2.2]octane muscarinic acetylcholine receptor antagonists. J Med Chem 52:2493-505 (2009)  
Target
Name:
Muscarinic acetylcholine receptor M3
Synonyms:
ACM3_HUMAN Cholinergic, muscarinic M3 Muscarinic receptor M3 | RecName: Full=Muscarinic acetylcholine receptor M3
Type:
Enzyme
Mol. Mass.:
66151.03
Organism:
Homo sapiens (Human)
Description:
P20309
Residue:
590
  
Inhibitor
Name:
BDBM50003637
Synonyms:
CHEMBL523474
Type:
Small organic molecule
Emp. Form.:
C29H33BrClNO2
Mol. Mass.:
542.935
SMILES:
[Br-].OC(c1ccccc1)(c1ccccc1)C12CC[N+](CCOCc3ccc(Cl)cc3)(CC1)CC2
: