Target
Cyclin-dependent kinase 4
Ligand
BDBM50267867
Substrate
Meas. Tech.
ChEMBL_563013 (CHEMBL1016197)
IC50
4±n/a nM
Citation
 Tsou, HRLiu, XBirnberg, GKaplan, JOtteng, MTran, TKutterer, KTang, ZSuayan, RZask, ARavi, MBretz, AGrillo, MMcGinnis, JPRabindran, SKAyral-Kaloustian, SMansour, TS Discovery of 4-(benzylaminomethylene)isoquinoline-1,3-(2H,4H)-diones and 4-[(pyridylmethyl)aminomethylene]isoquinoline-1,3-(2H,4H)-diones as potent and selective inhibitors of the cyclin-dependent kinase 4. J Med Chem 52:2289-310 (2009)  
Target
Name:
Cyclin-dependent kinase 4
Synonyms:
CDK4 Cell division protein kinase 4 PSK-J3
Type:
Enzyme Subunit
Mol. Mass.:
33731.96
Organism:
Homo sapiens (Human)
Description:
P11802
Residue:
303
  
Inhibitor
Name:
BDBM50267867
Synonyms:
(4Z)-4-{[(3-hydroxy-4-methoxybenzyl)amino]methylene}-6-(1Hpyrrol-1-yl)isoquinoline-1,3(2H,4H)-dione | CHEMBL489445
Type:
Small organic molecule
Emp. Form.:
C22H19N3O4
Mol. Mass.:
389.404
SMILES:
COc1ccc(CNC=C2C(=O)NC(=O)c3ccc(cc23)-n2cccc2)cc1O
: