Target
Sodium- and chloride-dependent glycine transporter 1
Ligand
BDBM50277903
Substrate
Meas. Tech.
ChEMBL_501634 (CHEMBL993724)
IC50
871±n/a nM
Citation
 Thomson, JLBlackaby, WPJennings, ASGoodacre, SCPike, AThomas, SBrown, TASmith, APillai, GStreet, LJLewis, RT Optimisation of a series of potent, selective and orally bioavailable GlyT1 inhibitors. Bioorg Med Chem Lett 19:2235-9 (2009)  
Target
Name:
Sodium- and chloride-dependent glycine transporter 1
Synonyms:
GlyT-1 Glycine Transporters (GlyT1c) SC6A9_HUMAN Sodium- and chloride-dependent glycine transporter 1 Sodium- and chloride-dependent glycine transporter 1 (GlyT1c) Solute carrier family 6 member 9
Type:
Enzyme
Mol. Mass.:
78270.54
Organism:
Homo sapiens (Human)
Description:
P48067
Residue:
706
  
Inhibitor
Name:
BDBM50277903
Synonyms:
CHEMBL519701 | N-((1-(1H-1,2,3-triazol-4-ylsulfonyl)-3-(cyclopropylmethyl)azetidin-3-yl)methyl)-2,4-dichlorobenzamide
Type:
Small organic molecule
Emp. Form.:
C17H19Cl2N5O3S
Mol. Mass.:
444.335
SMILES:
Clc1ccc(C(=O)NCC2(CC3CC3)CN(C2)S(=O)(=O)c2cnn[nH]2)c(Cl)c1
: