Target
Cannabinoid receptor 1
Ligand
BDBM50267257
Substrate
Meas. Tech.
ChEMBL_563053 (CHEMBL1011883)
EC50
0.5±n/a nM
Citation
 Vachal, PFletcher, JMFong, TMHuang, CCLao, JXiao, JCShen, CPStrack, AMShearman, LStribling, SChen, RZFrassetto, ATong, XWang, JBall, RGTsou, NNHickey, GJThompson, DFFaidley, TDNicolich, SAchanfuo-Yeboah, JHora, DFHale, JJHagmann, WK 1-Sulfonyl-4-acylpiperazines as selective cannabinoid-1 receptor (CB1R) inverse agonists for the treatment of obesity. J Med Chem 52:2550-8 (2009)  
Target
Name:
Cannabinoid receptor 1
Synonyms:
CANN6 CB-R CNR CNR1_HUMAN Cannabinoid receptor Cannabinoid receptor 1 (brain)
Type:
G Protein-Coupled Receptor (GPCR)
Mol. Mass.:
52868.96
Organism:
Homo sapiens (Human)
Description:
P21554
Residue:
472
  
Inhibitor
Name:
BDBM50267257
Synonyms:
4-(2-(4-(3,5-dichlorophenylsulfonyl)piperazin-1-yl)-2-oxoethyl)benzonitrile | CHEMBL515641
Type:
Small organic molecule
Emp. Form.:
C19H17Cl2N3O3S
Mol. Mass.:
438.328
SMILES:
Clc1cc(Cl)cc(c1)S(=O)(=O)N1CCN(CC1)C(=O)Cc1ccc(cc1)C#N
: