Target
Metabotropic glutamate receptor 2
Ligand
BDBM50278006
Substrate
Meas. Tech.
ChEMBL_502279 (CHEMBL983950)
EC50
4380±n/a nM
Citation
 Duplantier, AJEfremov, ICandler, JDoran, ACGanong, AHHaas, JAHanks, ANKraus, KGLazzaro, JTLu, JMaklad, NMcCarthy, SAO'Sullivan, TJRogers, BNSiuciak, JASpracklin, DKZhang, L 3-Benzyl-1,3-oxazolidin-2-ones as mGluR2 positive allosteric modulators: Hit-to lead and lead optimization. Bioorg Med Chem Lett 19:2524-9 (2009)  
Target
Name:
Metabotropic glutamate receptor 2
Synonyms:
GPRC1B GRM2_HUMAN Metabotropic glutamate receptor mGlu2 | metabotropic glutamate 2
Type:
Enzyme
Mol. Mass.:
95584.88
Organism:
Homo sapiens (Human)
Description:
Q14416
Residue:
872
  
Inhibitor
Name:
BDBM50278006
Synonyms:
(R)-5-methyl-3-(4-(pyrimidin-5-yl)benzyl)oxazolidin-2-one | CHEMBL484403
Type:
Small organic molecule
Emp. Form.:
C15H15N3O2
Mol. Mass.:
269.2985
SMILES:
C[C@@H]1CN(Cc2ccc(cc2)-c2cncnc2)C(=O)O1
: