Target
Cannabinoid receptor 1
Ligand
BDBM50267753
Substrate
Meas. Tech.
ChEMBL_563541 (CHEMBL961828)
Ki
100±n/a nM
Citation
 Brizzi, ABrizzi, VCascio, MGCorelli, FGuida, FLigresti, AMaione, SMartinelli, APasquini, STuccinardi, TDi Marzo, V New resorcinol-anandamide"hybrids" as potent cannabinoid receptor ligands endowed with antinociceptive activity in vivo. J Med Chem 52:2506-14 (2009)  
Target
Name:
Cannabinoid receptor 1
Synonyms:
CANN6 CB-R CNR CNR1_HUMAN Cannabinoid receptor Cannabinoid receptor 1 (brain)
Type:
G Protein-Coupled Receptor (GPCR)
Mol. Mass.:
52868.96
Organism:
Homo sapiens (Human)
Description:
P21554
Residue:
472
  
Inhibitor
Name:
BDBM50267753
Synonyms:
CHEMBL484887 | N-(cyclopropylmethyl)-8-(3-hydroxy-5-(2-methyloctan-2-yl)phenoxy)octanamide
Type:
Small organic molecule
Emp. Form.:
C27H45NO3
Mol. Mass.:
431.6511
SMILES:
CCCCCCC(C)(C)c1cc(O)cc(OCCCCCCCC(=O)NCC2CC2)c1
: