Target
Cannabinoid receptor 2
Ligand
BDBM50267638
Substrate
Meas. Tech.
ChEMBL_563542 (CHEMBL961829)
Ki
80±n/a nM
Citation
 Brizzi, ABrizzi, VCascio, MGCorelli, FGuida, FLigresti, AMaione, SMartinelli, APasquini, STuccinardi, TDi Marzo, V New resorcinol-anandamide"hybrids" as potent cannabinoid receptor ligands endowed with antinociceptive activity in vivo. J Med Chem 52:2506-14 (2009)  
Target
Name:
Cannabinoid receptor 2
Synonyms:
CANNABINOID CB2 CB2 CB2B CNR2_HUMAN Cannabinoid CB2 receptor Cannabinoid receptor 2 (CB2R) | hCB2
Type:
G Protein-Coupled Receptor (GPCR)
Mol. Mass.:
39690.94
Organism:
Homo sapiens (Human)
Description:
P34972
Residue:
360
  
Inhibitor
Name:
BDBM50267638
Synonyms:
12-(3-hydroxy-5-(2-methyloctan-2-yl)phenoxy)-N-(2-hydroxyethyl)dodecanamide | CHEMBL490035
Type:
Small organic molecule
Emp. Form.:
C29H51NO4
Mol. Mass.:
477.7195
SMILES:
CCCCCCC(C)(C)c1cc(O)cc(OCCCCCCCCCCCC(=O)NCCO)c1
: