Target
Cannabinoid receptor 2
Ligand
BDBM50267712
Substrate
Meas. Tech.
ChEMBL_563542 (CHEMBL961829)
Ki
20±n/a nM
Citation
 Brizzi, ABrizzi, VCascio, MGCorelli, FGuida, FLigresti, AMaione, SMartinelli, APasquini, STuccinardi, TDi Marzo, V New resorcinol-anandamide"hybrids" as potent cannabinoid receptor ligands endowed with antinociceptive activity in vivo. J Med Chem 52:2506-14 (2009)  
Target
Name:
Cannabinoid receptor 2
Synonyms:
CANNABINOID CB2 CB2 CB2B CNR2_HUMAN Cannabinoid CB2 receptor Cannabinoid receptor 2 (CB2R) | hCB2
Type:
G Protein-Coupled Receptor (GPCR)
Mol. Mass.:
39690.94
Organism:
Homo sapiens (Human)
Description:
P34972
Residue:
360
  
Inhibitor
Name:
BDBM50267712
Synonyms:
CHEMBL489252 | N-cyclopropyl-12-(3-hydroxy-5-(2-methyloctan-2-yl)phenoxy)dodecanamide
Type:
Small organic molecule
Emp. Form.:
C30H51NO3
Mol. Mass.:
473.7308
SMILES:
CCCCCCC(C)(C)c1cc(O)cc(OCCCCCCCCCCCC(=O)NC2CC2)c1
: