Target
Cannabinoid receptor 1
Ligand
BDBM50267670
Substrate
Meas. Tech.
ChEMBL_563547 (CHEMBL961834)
IC50
>10000±n/a nM
Citation
 Brizzi, ABrizzi, VCascio, MGCorelli, FGuida, FLigresti, AMaione, SMartinelli, APasquini, STuccinardi, TDi Marzo, V New resorcinol-anandamide"hybrids" as potent cannabinoid receptor ligands endowed with antinociceptive activity in vivo. J Med Chem 52:2506-14 (2009)  
Target
Name:
Cannabinoid receptor 1
Synonyms:
Brain-type cannabinoid receptor CB-R CNR1_RAT Cannabinoid receptor Cnr1 | Skr6
Type:
G Protein-Coupled Receptor (GPCR)
Mol. Mass.:
52856.55
Organism:
Rattus norvegicus (rat)
Description:
P20272
Residue:
473
  
Inhibitor
Name:
BDBM50267670
Synonyms:
CHEMBL490046 | N-cyclopropyl-11-(3,5-dihydroxyphenoxy)undecanamide
Type:
Small organic molecule
Emp. Form.:
C20H31NO4
Mol. Mass.:
349.4644
SMILES:
Oc1cc(O)cc(OCCCCCCCCCCC(=O)NC2CC2)c1
: