Target
Cannabinoid receptor 1
Ligand
BDBM50267602
Substrate
Meas. Tech.
ChEMBL_563541 (CHEMBL961828)
Ki
316±n/a nM
Citation
 Brizzi, ABrizzi, VCascio, MGCorelli, FGuida, FLigresti, AMaione, SMartinelli, APasquini, STuccinardi, TDi Marzo, V New resorcinol-anandamide"hybrids" as potent cannabinoid receptor ligands endowed with antinociceptive activity in vivo. J Med Chem 52:2506-14 (2009)  
Target
Name:
Cannabinoid receptor 1
Synonyms:
CANN6 CB-R CNR CNR1_HUMAN Cannabinoid receptor Cannabinoid receptor 1 (brain)
Type:
G Protein-Coupled Receptor (GPCR)
Mol. Mass.:
52868.96
Organism:
Homo sapiens (Human)
Description:
P21554
Residue:
472
  
Inhibitor
Name:
BDBM50267602
Synonyms:
11-(3-hydroxy-5-(2-methyloctan-2-yl)phenoxy)-N-(2-hydroxyethyl)undecanamide | CHEMBL491658
Type:
Small organic molecule
Emp. Form.:
C28H49NO4
Mol. Mass.:
463.693
SMILES:
CCCCCCC(C)(C)c1cc(O)cc(OCCCCCCCCCCC(=O)NCCO)c1
: