Target
Neuronal acetylcholine receptor subunit alpha-7
Ligand
BDBM50267883
Substrate
Meas. Tech.
ChEMBL_563561 (CHEMBL961848)
IC50
1730±n/a nM
Citation
 Ulens, CAkdemir, AJongejan, Avan Elk, RBertrand, SPerrakis, ALeurs, RSmit, ABSixma, TKBertrand, Dde Esch, IJ Use of acetylcholine binding protein in the search for novel alpha7 nicotinic receptor ligands. In silico docking, pharmacological screening, and X-ray analysis. J Med Chem 52:2372-83 (2009)  
Target
Name:
Neuronal acetylcholine receptor subunit alpha-7
Synonyms:
ACHA7_HUMAN Cholinergic, Nicotinic Alpha7 Neuronal acetylcholine receptor protein alpha-7 subunit Nicotinic acetylcholine receptor alpha-7 (alpha7 nAChR)
Type:
Mol. Mass.:
56448.33
Organism:
Homo sapiens (Human)
Description:
CHRNA7 (NACHRA7)
Residue:
502
  
Inhibitor
Name:
BDBM50267883
Synonyms:
8-Benzyl-3-(10,11-dihydro-5H-dibenzo[a,d]cyclohepten-5-yloxy)-8-aza-bicyclo[3.2.1]octane | CHEMBL491861
Type:
Small organic molecule
Emp. Form.:
C29H31NO
Mol. Mass.:
409.5625
SMILES:
C(N1C2CCC1CC(C2)OC1c2ccccc2CCc2ccccc12)c1ccccc1
: