Target
Acetylcholine-binding protein
Ligand
BDBM50413511
Substrate
Meas. Tech.
ChEMBL_563557 (CHEMBL961844)
Ki
3162.28±n/a nM
Citation
 Ulens, CAkdemir, AJongejan, Avan Elk, RBertrand, SPerrakis, ALeurs, RSmit, ABSixma, TKBertrand, Dde Esch, IJ Use of acetylcholine binding protein in the search for novel alpha7 nicotinic receptor ligands. In silico docking, pharmacological screening, and X-ray analysis. J Med Chem 52:2372-83 (2009)  
Target
Name:
Acetylcholine-binding protein
Synonyms:
ACHP_LYMST Acetylcholine Binding protein Acetylcholine-binding protein (Ls-AchBP) | AchBP
Type:
Mol. Mass.:
26055.52
Organism:
Lymnaea stagnalis
Description:
Soluble acetylcholine receptor
Residue:
229
  
Inhibitor
Name:
BDBM50413511
Synonyms:
CHEMBL489015
Type:
Small organic molecule
Emp. Form.:
C20H23NO
Mol. Mass.:
293.4027
SMILES:
C1CC(CCN1)OC1c2ccccc2CCc2ccccc12
: