Target
Acetylcholine-binding protein
Ligand
BDBM50413516
Substrate
Meas. Tech.
ChEMBL_563557 (CHEMBL961844)
Ki
100±n/a nM
Citation
 Ulens, CAkdemir, AJongejan, Avan Elk, RBertrand, SPerrakis, ALeurs, RSmit, ABSixma, TKBertrand, Dde Esch, IJ Use of acetylcholine binding protein in the search for novel alpha7 nicotinic receptor ligands. In silico docking, pharmacological screening, and X-ray analysis. J Med Chem 52:2372-83 (2009)  
Target
Name:
Acetylcholine-binding protein
Synonyms:
ACHP_LYMST Acetylcholine Binding protein Acetylcholine-binding protein (Ls-AchBP) | AchBP
Type:
Mol. Mass.:
26055.52
Organism:
Lymnaea stagnalis
Description:
Soluble acetylcholine receptor
Residue:
229
  
Inhibitor
Name:
BDBM50413516
Synonyms:
CHEMBL522249
Type:
Small organic molecule
Emp. Form.:
C25H29NO3
Mol. Mass.:
391.5027
SMILES:
CN1C2CCC1CC(C2)OC(=O)COC1c2ccccc2CCc2ccccc12
: