Target
Cytochrome P450 2D6
Ligand
BDBM50259616
Substrate
Meas. Tech.
ChEMBL_500937 (CHEMBL971452)
IC50
>10000±n/a nM
Citation
 Clutterbuck, LAPosada, CGVisintin, CRiddall, DRLancaster, BGane, PJGarthwaite, JSelwood, DL Oxadiazolylindazole sodium channel modulators are neuroprotective toward hippocampal neurones. J Med Chem 52:2694-707 (2009)  
Target
Name:
Cytochrome P450 2D6
Synonyms:
CP2D6_HUMAN CYP2DL1 Cytochrome P450 2D6 (CYP2D6) P450-DB1
Type:
Protein
Mol. Mass.:
55774.82
Organism:
Homo sapiens (Human)
Description:
P10635
Residue:
497
  
Inhibitor
Name:
BDBM50259616
Synonyms:
CHEMBL511760 | Tert-butyl(5-(1-acetyl-1H-indazol-3-yl)-1,2,4-oxadiazol-3-yl)methylcarbamate
Type:
Small organic molecule
Emp. Form.:
C17H19N5O4
Mol. Mass.:
357.3639
SMILES:
CC(=O)n1nc(-c2nc(CNC(=O)OC(C)(C)C)no2)c2ccccc12
: