Target
Peroxisome proliferator-activated receptor alpha
Ligand
BDBM50277933
Substrate
Meas. Tech.
ChEMBL_502069 (CHEMBL983194)
IC50
393±n/a nM
Citation
 Bénardeau, ABenz, JBinggeli, ABlum, DBoehringer, MGrether, UHilpert, HKuhn, BMärki, HPMeyer, MPüntener, KRaab, SRuf, ASchlatter, DMohr, P Aleglitazar, a new, potent, and balanced dual PPARalpha/gamma agonist for the treatment of type II diabetes. Bioorg Med Chem Lett 19:2468-73 (2009)  
Target
Name:
Peroxisome proliferator-activated receptor alpha
Synonyms:
NR1C1 PPAR PPAR-alpha PPARA_HUMAN Peroxisome proliferator-activated receptor | Peroxisome proliferator-activated receptor alpha (PPAR alpha)
Type:
Enzyme
Mol. Mass.:
52222.08
Organism:
Homo sapiens (Human)
Description:
Q07869
Residue:
468
  
Inhibitor
Name:
BDBM50277933
Synonyms:
(S)-3-(4-(2-(5-methyl-2-phenyloxazol-4-yl)ethoxy)benzo[b]thiophen-7-yl)-2-propoxypropanoic acid | CHEMBL484606
Type:
Small organic molecule
Emp. Form.:
C26H27NO5S
Mol. Mass.:
465.561
SMILES:
CCCO[C@@H](Cc1ccc(OCCc2nc(oc2C)-c2ccccc2)c2ccsc12)C(O)=O
: