Target
Mitogen-activated protein kinase 9
Ligand
BDBM50277623
Substrate
Meas. Tech.
ChEMBL_501540 (CHEMBL984180)
IC50
3±n/a nM
Citation
 Cirillo, PFHickey, ERMoss, NBreitfelder, SBetageri, RFadra, TGaenzler, FGilmore, TGoldberg, DRKamhi, VKirrane, TKroe, RRMadwed, JMoriak, MNetherton, MPargellis, CAPatel, URQian, KCSharma, RSun, SSwinamer, ATorcellini, CTakahashi, HTsang, MXiong, Z Discovery and characterization of the N-phenyl-N'-naphthylurea class of p38 kinase inhibitors. Bioorg Med Chem Lett 19:2386-91 (2009)  
Target
Name:
Mitogen-activated protein kinase 9
Synonyms:
JNK-55 JNK2/JNK3 MK09_HUMAN Mitogen-activated protein kinase 8/9 SAPK1A c-Jun N-terminal kinase 2 | c-Jun N-terminal kinase 2 (JNK2)
Type:
Enzyme
Mol. Mass.:
48131.49
Organism:
Homo sapiens (Human)
Description:
JNK-2 was purchased from Upstate Cell Signaling Solutions (formerly Upstate Biotechnology).
Residue:
424
  
Inhibitor
Name:
BDBM50277623
Synonyms:
CHEMBL451523 N-{5-tert-butyl-2-methoxy-3-[({4-[6-(morpholin-4-ylmethyl)pyridin-3-yl]naphthalen-1-yl}carbamoyl)amino]phenyl}methanesulfonamide
Type:
Small organic molecule
Emp. Form.:
C33H39N5O5S
Mol. Mass.:
617.758
SMILES:
COc1c(NC(=O)Nc2ccc(-c3ccc(CN4CCOCC4)nc3)c3ccccc23)cc(cc1NS(C)(=O)=O)C(C)(C)C
: