Target
MAP kinase-activated protein kinase 2
Ligand
BDBM50259599
Substrate
Meas. Tech.
ChEMBL_499146 (CHEMBL1011420)
IC50
>100000±n/a nM
Citation
 Lovering, FKirincich, SWang, WCombs, KResnick, LSabalski, JEButera, JLiu, JParris, KTelliez, JB Identification and SAR of squarate inhibitors of mitogen activated protein kinase-activated protein kinase 2 (MK-2). Bioorg Med Chem 17:3342-51 (2009)  
Target
Name:
MAP kinase-activated protein kinase 2
Synonyms:
MAP kinase-activated protein kinase 2 (MAPKAPK2) MAP kinase-activated protein kinase 2 (p38/MK2) MAPK-activated protein kinase 2 MAPKAP kinase 2 MAPKAPK2 | MK2
Type:
Serine/threonine-protein kinase
Mol. Mass.:
45579.87
Organism:
Homo sapiens (Human)
Description:
P49137
Residue:
400
  
Inhibitor
Name:
BDBM50259599
Synonyms:
3-[(2-Chloropyridin-4-yl)amino]-4-{[(1R)-1-phenylethyl]amino}cyclobut-3-ene-1,2-dione | CHEMBL468321
Type:
Small organic molecule
Emp. Form.:
C17H14ClN3O2
Mol. Mass.:
327.765
SMILES:
C[C@@H](Nc1c(Nc2ccnc(Cl)c2)c(=O)c1=O)c1ccccc1
: