Target
Beta-3 adrenergic receptor
Ligand
BDBM50249638
Substrate
Meas. Tech.
ChEMBL_497791 (CHEMBL1007087)
EC50
0.500000±n/a nM
Citation
 Hattori, KToda, SImanishi, MItou, SNakajima, YWashizuka, KAraki, THamashima, HTomishima, YSakurai, MMatsui, SImamura, EUeshima, KYamamoto, TYamamoto, NIshikawa, HNakano, KUnami, NHamada, KMatsumura, YTakamura, F Discovery of highly potent and selective biphenylacylsulfonamide-based beta3-adrenergic receptor agonists and evaluation of physical properties as potential overactive bladder therapies: part 5. J Med Chem 52:3063-72 (2009)  
Target
Name:
Beta-3 adrenergic receptor
Synonyms:
ADRB3 ADRB3_HUMAN Beta-2 adrenergic receptor and beta-3 adrenergic receptor Beta-3 adrenoreceptor | adrenergic Beta3
Type:
G Protein-Coupled Receptor (GPCR)
Mol. Mass.:
43534.88
Organism:
Homo sapiens (Human)
Description:
Residue:
408
  
Inhibitor
Name:
BDBM50249638
Synonyms:
4'-(2-{[(2R)-2-(4-Aminophenyl)-2-hydroxyethyl]amino}ethyl)-3-(cyclohexyloxy)-N-(methylsulfonyl)biphenyl-4-carboxamide Dihydrochloride CHEMBL556852
Type:
Small organic molecule
Emp. Form.:
C30H37N3O5S
Mol. Mass.:
551.697
SMILES:
CS(=O)(=O)NC(=O)c1ccc(cc1OC1CCCCC1)-c1ccc(CCNC[C@H](O)c2ccc(N)cc2)cc1
: