Target
Protein kinase C delta type
Ligand
BDBM50249959
Substrate
Meas. Tech.
ChEMBL_498041 (CHEMBL995912)
Ki
2.7±n/a nM
Citation
 Comin, MJCzifra, GKedei, NTelek, ALewin, NEKolusheva, SVelasquez, JFKobylarz, RJelinek, RBlumberg, PMMarquez, VE Conformationally constrained analogues of diacylglycerol (DAG). 31. Modulation of the biological properties of diacylgycerol lactones (DAG-lactones) containing rigid-rod acyl groups separated from the core lactone by spacer units of different lengths. J Med Chem 52:3274-83 (2009)  
Target
Name:
Protein kinase C delta type
Synonyms:
KPCD_HUMAN PKCD Protein Kinase C- delta nPKC-delta
Type:
Enzyme
Mol. Mass.:
77516.79
Organism:
Homo sapiens (Human)
Description:
The recombinant human PKC enzymes were produced using a baculovirus expression system in SF9 cells
Residue:
676
  
Inhibitor
Name:
BDBM50249959
Synonyms:
CHEMBL522428 | [2-(Hydroxymethyl)-4-(methylethylidene)-5-oxo-2-2,3-dihydrofuryl]methyl 4-[2-(4-Methylphenyl)ethynyl]benzoate
Type:
Small organic molecule
Emp. Form.:
C25H24O5
Mol. Mass.:
404.4551
SMILES:
[#6]\[#6](-[#6])=[#6]-1/[#6]C([#6]-[#8])([#6]-[#8]-[#6](=O)-c2ccc(cc2)C#Cc2ccc(-[#6])cc2)[#8]-[#6]-1=O
: