Target
Alpha-1A adrenergic receptor
Ligand
BDBM50259333
Substrate
Meas. Tech.
ChEMBL_499389 (CHEMBL1015841)
EC50
234±n/a nM
Citation
 Whitlock, GABrennan, PERoberts, LRStobie, A Potent and selective alpha1A adrenoceptor partial agonists--novel imidazole frameworks. Bioorg Med Chem Lett 19:3118-21 (2009)  
Target
Name:
Alpha-1A adrenergic receptor
Synonyms:
ADA1A_HUMAN ADRA1C Alpha 1A-adrenoceptor Alpha adrenergic receptor 1a Alpha-adrenergic receptor 1c adrenergic Alpha1 | adrenergic Alpha1C
Type:
Cell-surface receptors
Mol. Mass.:
51511.67
Organism:
Homo sapiens (Human)
Description:
P35348
Residue:
466
  
Inhibitor
Name:
BDBM50259333
Synonyms:
6-phenyl-4,5,6,7-tetra hydro-1H-benzo[d]imidazole CHEMBL466296
Type:
Small organic molecule
Emp. Form.:
C13H14N2
Mol. Mass.:
198.2637
SMILES:
C1Cc2nc[nH]c2CC1c1ccccc1
: