Target
Alpha-1D adrenergic receptor
Ligand
BDBM50259538
Substrate
Meas. Tech.
ChEMBL_499392 (CHEMBL1015844)
EC50
>10000±n/a nM
Citation
 Whitlock, GABrennan, PERoberts, LRStobie, A Potent and selective alpha1A adrenoceptor partial agonists--novel imidazole frameworks. Bioorg Med Chem Lett 19:3118-21 (2009)  
Target
Name:
Alpha-1D adrenergic receptor
Synonyms:
ADA1D_HUMAN ADRA1D Adrenergic receptor alpha Alpha 1D-adrenoreceptor Alpha-1D adrenoceptor adrenergic Alpha1D
Type:
Enzyme Catalytic Domain
Mol. Mass.:
60485.82
Organism:
Homo sapiens (Human)
Description:
adrenergic Alpha1D ADRA1D HUMAN::P25100
Residue:
572
  
Inhibitor
Name:
BDBM50259538
Synonyms:
6-(2-(methoxymethyl)phenyl)-6,7-dihydro-5H-pyrrolo[1,2-a]imidazole | CHEMBL511577
Type:
Small organic molecule
Emp. Form.:
C14H16N2O
Mol. Mass.:
228.2896
SMILES:
COCc1ccccc1C1Cc2nccn2C1
: