Target
Transient receptor potential cation channel subfamily V member 1
Ligand
BDBM50258475
Substrate
Meas. Tech.
ChEMBL_499843 (CHEMBL972475)
IC50
7200±n/a nM
Citation
 Li, FNKim, NJPaek, SMKwon, DYMin, KHJeong, YSKim, SYPark, YHKim, HDPark, HGSuh, YG Design, synthesis, and biological evaluation of novel diarylalkyl amides as TRPV1 antagonists. Bioorg Med Chem 17:3557-67 (2009)  
Target
Name:
Transient receptor potential cation channel subfamily V member 1
Synonyms:
Capsaicin receptor TRPV1_RAT Trpv1 Vanilloid VR1 Vanilloid receptor 1 (VRI/TRPV1) Vanilloid receptor type 1-like (TrpV1/Vr1) Vr1l | osm-9-like TRP channel 1
Type:
Transient Receptor
Mol. Mass.:
94956.12
Organism:
Rattus norvegicus (rat)
Description:
O35433
Residue:
838
  
Inhibitor
Name:
BDBM50258475
Synonyms:
3-(2,2-Dimethylchroman-6-yl)-N-(3-fluoro-4-(methylsulfonamido)benzyl)propanamide | CHEMBL469133
Type:
Small organic molecule
Emp. Form.:
C22H27FN2O4S
Mol. Mass.:
434.524
SMILES:
CC1(C)CCc2cc(CCC(=O)NCc3ccc(NS(C)(=O)=O)c(F)c3)ccc2O1
: