Target
Transient receptor potential cation channel subfamily V member 1
Ligand
BDBM50172598
Substrate
Meas. Tech.
ChEMBL_499843 (CHEMBL972475)
IC50
710±n/a nM
Citation
 Li, FNKim, NJPaek, SMKwon, DYMin, KHJeong, YSKim, SYPark, YHKim, HDPark, HGSuh, YG Design, synthesis, and biological evaluation of novel diarylalkyl amides as TRPV1 antagonists. Bioorg Med Chem 17:3557-67 (2009)  
Target
Name:
Transient receptor potential cation channel subfamily V member 1
Synonyms:
Capsaicin receptor TRPV1_RAT Trpv1 Vanilloid VR1 Vanilloid receptor 1 (VRI/TRPV1) Vanilloid receptor type 1-like (TrpV1/Vr1) Vr1l | osm-9-like TRP channel 1
Type:
Transient Receptor
Mol. Mass.:
94956.12
Organism:
Rattus norvegicus (rat)
Description:
O35433
Residue:
838
  
Inhibitor
Name:
BDBM50172598
Synonyms:
CHEMBL197781 N-{4-[3-(4-tert-Butyl-benzyl)-ureidomethyl]-2-fluoro-phenyl}-methanesulfonamide
Type:
Small organic molecule
Emp. Form.:
C20H26FN3O3S
Mol. Mass.:
407.502
SMILES:
CC(C)(C)c1ccc(CNC(=O)NCc2ccc(NS(C)(=O)=O)c(F)c2)cc1
: