Target
Transient receptor potential cation channel subfamily V member 1
Ligand
BDBM50258415
Substrate
Meas. Tech.
ChEMBL_499843 (CHEMBL972475)
IC50
180±n/a nM
Citation
 Li, FNKim, NJPaek, SMKwon, DYMin, KHJeong, YSKim, SYPark, YHKim, HDPark, HGSuh, YG Design, synthesis, and biological evaluation of novel diarylalkyl amides as TRPV1 antagonists. Bioorg Med Chem 17:3557-67 (2009)  
Target
Name:
Transient receptor potential cation channel subfamily V member 1
Synonyms:
Capsaicin receptor TRPV1_RAT Trpv1 Vanilloid VR1 Vanilloid receptor 1 (VRI/TRPV1) Vanilloid receptor type 1-like (TrpV1/Vr1) Vr1l | osm-9-like TRP channel 1
Type:
Transient Receptor
Mol. Mass.:
94956.12
Organism:
Rattus norvegicus (rat)
Description:
O35433
Residue:
838
  
Inhibitor
Name:
BDBM50258415
Synonyms:
CHEMBL493769 | N-(3-Fluoro-4-(methylsulfonamido)benzyl)-3-(5,5,8,8-tetramethyl-5,6,7,8-tetrahydronaphtha-alene-2-yl)propanamide
Type:
Small organic molecule
Emp. Form.:
C25H33FN2O3S
Mol. Mass.:
460.605
SMILES:
CC1(C)CCC(C)(C)c2cc(CCC(=O)NCc3ccc(NS(C)(=O)=O)c(F)c3)ccc12
: