Target
ATP-dependent translocase ABCB1
Ligand
BDBM50249649
Substrate
Meas. Tech.
ChEMBL_498553 (CHEMBL974426)
IC50
280±n/a nM
Citation
 Gannon, MKHolt, JJBennett, SMWetzel, BRLoo, TWBartlett, MCClarke, DMSawada, GAHiggins, JWTombline, GRaub, TJDetty, MR Rhodamine inhibitors of P-glycoprotein: an amide/thioamide"switch" for ATPase activity. J Med Chem 52:3328-41 (2009)  
Target
Name:
ATP-dependent translocase ABCB1
Synonyms:
Abcb1a MDR1A_MOUSE Mdr3 P-glycoprotein 1 and 3 (MDR1a/MDR1b) Pgy-3 | Pgy3
Type:
Protein
Mol. Mass.:
140669.02
Organism:
Mus musculus (Mouse)
Description:
P21447
Residue:
1276
  
Inhibitor
Name:
BDBM50249649
Synonyms:
CHEMBL490121 | Dimethyl-(8-phenyl-2,3,5,6-tetrahydro-1H,4H-13-selena-3a-aza-benzo[de]naphthacen-11-ylidene)-ammonium hexafluoro phosphate
Type:
Small organic molecule
Emp. Form.:
C27H27N2Se
Mol. Mass.:
458.48
SMILES:
C[N+](C)=c1ccc2c(-c3ccccc3)c3cc4CCCN5CCCc(c45)c3[se]c2c1
: