Target
Casein kinase II subunit alpha
Ligand
BDBM11319
Substrate
Meas. Tech.
ChEMBL_500824 (CHEMBL974405)
IC50
390±n/a nM
Citation
 Sekiguchi, YNakaniwa, TKinoshita, TNakanishi, IKitaura, KHirasawa, ATsujimoto, GTada, T Structural insight into human CK2alpha in complex with the potent inhibitor ellagic acid. Bioorg Med Chem Lett 19:2920-3 (2009)  
Target
Name:
Casein kinase II subunit alpha
Synonyms:
CK II CK2- alpha CSK21_HUMAN Casein kinase 2 Casein kinase II alpha/beta Casein kinase II subunit alpha (CK2A1) Casein kinase II subunit alpha (CK2a V66A) Casein kinase II subunit alpha (CK2a)
Type:
Enzyme
Mol. Mass.:
45151.12
Organism:
Homo sapiens (Human)
Description:
P68400
Residue:
391
  
Inhibitor
Name:
BDBM11319
Synonyms:
(5-oxo-5,6-dihydroindolo[1,2-a]quinazolin-7-yl)acetic acid CGP029482 IQA
Type:
Small organic molecule
Emp. Form.:
C17H12N2O3
Mol. Mass.:
292.2888
SMILES:
OC(=O)Cc1c2ccccc2n2c1[nH]c(=O)c1ccccc21
: