Target
Mitogen-activated protein kinase 14
Ligand
BDBM50258287
Substrate
Meas. Tech.
ChEMBL_500029 (CHEMBL1025477)
Ki
>4000±n/a nM
Citation
 Grey, RPierce, ACBemis, GWJacobs, MDMoody, CSJajoo, RMohal, NGreen, J Structure-based design of 3-aryl-6-amino-triazolo[4,3-b]pyridazine inhibitors of Pim-1 kinase. Bioorg Med Chem Lett 19:3019-22 (2009)  
Target
Name:
Mitogen-activated protein kinase 14
Synonyms:
CSAID-binding protein CSBP1 CSPB1 MAP kinase 14 MAP kinase p38 alpha MAPK14 MK14_HUMAN Mitogen-activated protein kinase p38 alpha Stress-activated protein kinase 2a | p38 MAP kinase alpha/beta
Type:
Serine/threonine-protein kinase
Mol. Mass.:
41286.76
Organism:
Homo sapiens (Human)
Description:
Q16539
Residue:
360
  
Inhibitor
Name:
BDBM50258287
Synonyms:
CHEMBL493169 | N-(piperidin-4-yl)-3-(3-(trifluoromethyl)phenyl)-[1,2,4]triazolo[4,3-b]pyridazin-6-amine
Type:
Small organic molecule
Emp. Form.:
C17H17F3N6
Mol. Mass.:
362.3523
SMILES:
FC(F)(F)c1cccc(c1)-c1nnc2ccc(NC3CCNCC3)nn12
: