Target
Hepatocyte growth factor receptor
Ligand
BDBM50258424
Substrate
Meas. Tech.
ChEMBL_500028 (CHEMBL1025476)
Ki
>4000±n/a nM
Citation
 Grey, RPierce, ACBemis, GWJacobs, MDMoody, CSJajoo, RMohal, NGreen, J Structure-based design of 3-aryl-6-amino-triazolo[4,3-b]pyridazine inhibitors of Pim-1 kinase. Bioorg Med Chem Lett 19:3019-22 (2009)  
Target
Name:
Hepatocyte growth factor receptor
Synonyms:
Hepatocyte growth factor receptor Hepatocyte growth factor receptor (c-MET) MET Met proto-oncogene (hepatocyte growth factor receptor) Tyrosine-protein kinase Met (c-Met) c-Met kinase
Type:
Protein
Mol. Mass.:
155559.73
Organism:
Homo sapiens (Human)
Description:
P08581
Residue:
1390
  
Inhibitor
Name:
BDBM50258424
Synonyms:
CHEMBL494221 | trans-4-(3-(3-(trifluoromethyl)phenyl)-[1,2,4]triazolo[4,3-b]pyridazin-6-ylamino)cyclohexanol
Type:
Small organic molecule
Emp. Form.:
C18H18F3N5O
Mol. Mass.:
377.3636
SMILES:
O[C@H]1CC[C@@H](CC1)Nc1ccc2nnc(-c3cccc(c3)C(F)(F)F)n2n1
: