Target
Serine/threonine-protein kinase pim-1
Ligand
BDBM26668
Substrate
Meas. Tech.
ChEMBL_500013 (CHEMBL1022925)
Ki
11±n/a nM
Citation
 Grey, RPierce, ACBemis, GWJacobs, MDMoody, CSJajoo, RMohal, NGreen, J Structure-based design of 3-aryl-6-amino-triazolo[4,3-b]pyridazine inhibitors of Pim-1 kinase. Bioorg Med Chem Lett 19:3019-22 (2009)  
Target
Name:
Serine/threonine-protein kinase pim-1
Synonyms:
PIM-1 Kinase PIM1_HUMAN Serine/threonine-protein kinase (PIM1) Serine/threonine-protein kinase PIM1 | Serine/threonine-protein kinase pim-1 (PIM1)
Type:
Protein
Mol. Mass.:
35681.82
Organism:
Homo sapiens (Human)
Description:
P11309
Residue:
313
  
Inhibitor
Name:
BDBM26668
Synonyms:
CHEMBL494360 triazolopyridazine compound, 1
Type:
Small organic molecule
Emp. Form.:
C18H18F3N5
Mol. Mass.:
361.3642
SMILES:
FC(F)(F)c1cccc(c1)-c1nnc2ccc(NC3CCCCC3)nn12
: