Target
Alpha-1A adrenergic receptor
Ligand
BDBM50258518
Substrate
Meas. Tech.
ChEMBL_500044 (CHEMBL970447)
EC50
12±n/a nM
Citation
 Roberts, LRFish, PVIan Storer, RWhitlock, GA 6,7-Dihydro-5H-pyrrolo[1,2-a] imidazoles as potent and selective alpha1A adrenoceptor partial agonists. Bioorg Med Chem Lett 19:3113-7 (2009)  
Target
Name:
Alpha-1A adrenergic receptor
Synonyms:
ADA1A_HUMAN ADRA1C Alpha 1A-adrenoceptor Alpha adrenergic receptor 1a Alpha-adrenergic receptor 1c adrenergic Alpha1 | adrenergic Alpha1C
Type:
Cell-surface receptors
Mol. Mass.:
51511.67
Organism:
Homo sapiens (Human)
Description:
P35348
Residue:
466
  
Inhibitor
Name:
BDBM50258518
Synonyms:
(S)-6-(biphenyl-2-yl)-6,7-dihydro-5H-pyrrolo[1,2-a]imidazole | CHEMBL512062
Type:
Small organic molecule
Emp. Form.:
C18H16N2
Mol. Mass.:
260.333
SMILES:
C1[C@H](Cn2ccnc12)c1ccccc1-c1ccccc1
: