Target
Alpha-1D adrenergic receptor
Ligand
BDBM50258641
Substrate
Meas. Tech.
ChEMBL_500048 (CHEMBL970451)
EC50
276±n/a nM
Citation
 Roberts, LRFish, PVIan Storer, RWhitlock, GA 6,7-Dihydro-5H-pyrrolo[1,2-a] imidazoles as potent and selective alpha1A adrenoceptor partial agonists. Bioorg Med Chem Lett 19:3113-7 (2009)  
Target
Name:
Alpha-1D adrenergic receptor
Synonyms:
ADA1D_HUMAN ADRA1D Adrenergic receptor alpha Alpha 1D-adrenoreceptor Alpha-1D adrenoceptor adrenergic Alpha1D
Type:
Enzyme Catalytic Domain
Mol. Mass.:
60485.82
Organism:
Homo sapiens (Human)
Description:
adrenergic Alpha1D ADRA1D HUMAN::P25100
Residue:
572
  
Inhibitor
Name:
BDBM50258641
Synonyms:
6-(4-fluoro-2-(1H-pyrazol-5-yl)phenyl)-6,7-dihydro-5H-pyrrolo[1,2-a]imidazole | CHEMBL511211
Type:
Small organic molecule
Emp. Form.:
C15H13FN4
Mol. Mass.:
268.2889
SMILES:
Fc1ccc(C2Cc3nccn3C2)c(c1)-c1cc[nH]n1
: