Target
Androgen receptor
Ligand
BDBM18665
Substrate
Meas. Tech.
ChEMBL_523646 (CHEMBL998017)
Ki
4±n/a nM
Citation
 Mohler, MLBohl, CEJones, ACoss, CCNarayanan, RHe, YHwang, DJDalton, JTMiller, DD Nonsteroidal selective androgen receptor modulators (SARMs): dissociating the anabolic and androgenic activities of the androgen receptor for therapeutic benefit. J Med Chem 52:3597-617 (2009)  
Target
Name:
Androgen receptor
Synonyms:
ANDR_HUMAN Androgen Receptor Androgen receptor/Baculoviral IAP repeat-containing protein 2 Dihydrotestosterone receptor Nuclear receptor subfamily 3 group C member 4
Type:
Receptor
Mol. Mass.:
99185.27
Organism:
Homo sapiens (Human)
Description:
CHO cells were stably transfected with human AR gene.
Residue:
920
  
Inhibitor
Name:
BDBM18665
Synonyms:
(2S)-3-(4-acetamidophenoxy)-2-hydroxy-2-methyl-N-[4-nitro-3-(trifluoromethyl)phenyl]propanamide CHEMBL125236 | Nonsteroidal AR Ligand, S-6
Type:
Small organic molecule
Emp. Form.:
C19H18F3N3O6
Mol. Mass.:
441.3579
SMILES:
CC(=O)Nc1ccc(OC[C@](C)(O)C(=O)Nc2ccc(c(c2)C(F)(F)F)[N+]([O-])=O)cc1
: