Target
Metabotropic glutamate receptor 5
Ligand
BDBM50258329
Substrate
Meas. Tech.
ChEMBL_523079 (CHEMBL1004109)
Ki
17±n/a nM
Citation
 Kulkarni, SSZou, MFCao, JDeschamps, JRRodriguez, ALConn, PJNewman, AH Structure-activity relationships comparing N-(6-methylpyridin-yl)-substituted aryl amides to 2-methyl-6-(substituted-arylethynyl)pyridines or 2-methyl-4-(substituted-arylethynyl)thiazoles as novel metabotropic glutamate receptor subtype 5 antagonists. J Med Chem 52:3563-75 (2009)  
Target
Name:
Metabotropic glutamate receptor 5
Synonyms:
GRM5_RAT Grm5 Mglur5 metabotropic glutamate 5/1-C metabotropic glutamate 5a
Type:
Enzyme
Mol. Mass.:
131900.14
Organism:
Rattus norvegicus (Rat)
Description:
P31424
Residue:
1203
  
Inhibitor
Name:
BDBM50258329
Synonyms:
2-(3-Fluorophenyl)-5-(6-methylpyridin-2-ylethynyl)benzonitrile | CHEMBL493773
Type:
Small organic molecule
Emp. Form.:
C20H11FN2
Mol. Mass.:
298.3131
SMILES:
Fc1cccc(c1)-c1ccc(cc1C#N)C#Cc1ccccn1
: