Target
Metabotropic glutamate receptor 5
Ligand
BDBM50149801
Substrate
Meas. Tech.
ChEMBL_523078 (CHEMBL1004108)
Ki
5.5±n/a nM
Citation
 Kulkarni, SSZou, MFCao, JDeschamps, JRRodriguez, ALConn, PJNewman, AH Structure-activity relationships comparing N-(6-methylpyridin-yl)-substituted aryl amides to 2-methyl-6-(substituted-arylethynyl)pyridines or 2-methyl-4-(substituted-arylethynyl)thiazoles as novel metabotropic glutamate receptor subtype 5 antagonists. J Med Chem 52:3563-75 (2009)  
Target
Name:
Metabotropic glutamate receptor 5
Synonyms:
GPRC1E GRM5_HUMAN metabotropic glutamate 5 | metabotropic glutamate 5a
Type:
Enzyme
Mol. Mass.:
132484.72
Organism:
Homo sapiens (Human)
Description:
Residue:
1212
  
Inhibitor
Name:
BDBM50149801
Synonyms:
2-Phenyl-5-(2-methylthiazol-4ylethynyl)pyridine CHEMBL184995
Type:
Small organic molecule
Emp. Form.:
C17H12N2S
Mol. Mass.:
276.356
SMILES:
Cc1nc(cs1)C#Cc1ccc(nc1)-c1ccccc1
: